BDBM404421 US10343992, Example 73::US10689345, Example 73::US11053198, Example 73::US11066365, Example 73::US11390584, Example 73
SMILES O=C(N[C@@H]1CCN(C1)C#N)c1ccnc(c1)N1Cc2ccccc2C1
InChI Key InChIKey=DMBLCGWOYRADPE-QGZVFWFLSA-N
Data  5 IC50
  Tab Delimited (TSV)   2D SDfile   Computed 3D by Vconf -m prep SDfile
Find this compound or compounds like it in BindingDB:
Activity Spreadsheet -- Enzyme Inhibition Constant Data from BindingDB
Found 5 hits for monomerid = 404421
TargetUbiquitin carboxyl-terminal hydrolase 30(Homo sapiens (Human))
Missions Therapeutics
US Patent
LigandPNGBDBM404421(US10343992, Example 73 | US10689345, Example 73 | ...)
Affinity DataIC50:  550nM. Assay description: Dilution plates were prepared at 21 times the final concentration (2100 μM for a final concentration of 100 μM) in 50% DMSO in a 96-well po...
Ligand InfoPC cidPC sid
In DepthDetails US Patent
TargetUbiquitin carboxyl-terminal hydrolase 30(Homo sapiens (Human))
Missions Therapeutics
US Patent
LigandPNGBDBM404421(US10343992, Example 73 | US10689345, Example 73 | ...)
Affinity DataIC50:  550nM. Assay description: USP30 Biochemical Fluorescence Intensity Kinetic Assay.Reactions were performed in duplicate in black 384 well plates (small volume, Greiner 784076) ...
Ligand InfoPC cidPC sid
In DepthDetails US Patent
TargetUbiquitin carboxyl-terminal hydrolase 30(Homo sapiens (Human))
Missions Therapeutics
US Patent
LigandPNGBDBM404421(US10343992, Example 73 | US10689345, Example 73 | ...)
Affinity DataIC50:  550nM. Assay description: Dilution plates were prepared at 21 times the final concentration (2100 μM for a final concentration of 100 μM) in 50% DMSO in a 96-well po...
Ligand InfoPC cidPC sid
In DepthDetails US Patent
TargetUbiquitin carboxyl-terminal hydrolase 30(Homo sapiens (Human))
Missions Therapeutics
US Patent
LigandPNGBDBM404421(US10343992, Example 73 | US10689345, Example 73 | ...)
Affinity DataIC50:  550nM. Assay description: Dilution plates were prepared at 21 times the final concentration (2100 μM for a final concentration of 100 μM) in 50% DMSO in a 96-well po...
Ligand InfoPC cidPC sid
In DepthDetails US Patent
TargetUbiquitin carboxyl-terminal hydrolase 30(Homo sapiens (Human))
Missions Therapeutics
US Patent
LigandPNGBDBM404421(US10343992, Example 73 | US10689345, Example 73 | ...)
Affinity DataIC50:  550nM. Assay description: USP30 biochemical fluorescence intensity IC50 assay Dilution plates were prepared at 21 times the final concentration (2100 μM for a final conce...
Ligand InfoPC cidPC sid
In DepthDetails US Patent