BDBM404471 (R)-3-chloro-N-(1- cyanopyrrolidin-3-yl)-5-(4- fluorophenyl)picolinamide::US10343992, Example 123::US11066365, Example 123::US11390584, Example 123
SMILES Fc1ccc(cc1)-c1cnc(C(=O)N[C@@H]2CCN(C2)C#N)c(Cl)c1
InChI Key InChIKey=YDZRHEBFSNARLZ-CQSZACIVSA-N
Data  3 IC50
  Tab Delimited (TSV)   2D SDfile   Computed 3D by Vconf -m prep SDfile
Find this compound or compounds like it in BindingDB:
Activity Spreadsheet -- Enzyme Inhibition Constant Data from BindingDB
Found 1 hit for monomerid = 404471
TargetUbiquitin carboxyl-terminal hydrolase 30(Homo sapiens (Human))
Mission Therapeutics
US Patent
LigandPNGBDBM404471((R)-3-chloro-N-(1- cyanopyrrolidin-3-yl)-5-(4- flu...)
Affinity DataIC50: <100nM. Assay description: USP30 biochemical fluorescence intensity IC50 assay Dilution plates were prepared at 21 times the final concentration (2100 μM for a final conce...
Ligand InfoPC cidPC sid
In DepthDetails US Patent