BDBM406503 US10336739, Example 96::ethyl 2-{5-[6-butyl- 5-(2,6- dimethoxyphenyl)- 2,4- dihydroxypyridin- 3-yl]-1,3,4- oxadiazol-2- yl}acetate
SMILES CCCCc1nc(O)c(-c2nnc(CC(=O)OCC)o2)c(O)c1-c1c(OC)cccc1OC
InChI Key InChIKey=NWVVFIGRWOMFPG-UHFFFAOYSA-N
Data  1 EC50
  Tab Delimited (TSV)   2D SDfile   Computed 3D by Vconf -m prep SDfile
Find this compound or compounds like it in BindingDB:
Activity Spreadsheet -- Enzyme Inhibition Constant Data from BindingDB
Found 1 hit for monomerid = 406503
TargetApelin receptor(Homo sapiens (Human))
Bristol-Myers Squibb
US Patent
LigandPNGBDBM406503(US10336739, Example 96 | ethyl 2-{5-[6-butyl- 5-(2...)
Affinity DataEC50:  55nM. Assay description: HEK293 cells stably expressing human APJ receptor were used to assess the activity of compounds. Cultured cells were detached and resuspended in the ...
Ligand InfoPC cidPC sid
In DepthDetails US Patent