BDBM407455 (R)-6-(3-cyanopyrrolo[1,2- b]pyridazin-7-yl)-N-(2- fluoro-3-hydroxy-3- methylbutyl)-4-((4-((2- methoxyethyl)carbamoyl) bicyclo[2.2.2]octan-1- yl)amino)nicotinamide::US10336762, Compound 397
SMILES COCCNC(=O)C12CCC(CC1)(CC2)Nc1cc(ncc1C(=O)NC[C@@H](F)C(C)(C)O)-c1ccc2cc(cnn12)C#N
InChI Key InChIKey=KXIFKPLZLJPRJC-GXUJUKEASA-N
Data  1 IC50  1 EC50
  Tab Delimited (TSV)   2D SDfile   Computed 3D by Vconf -m prep SDfile
Find this compound or compounds like it in BindingDB:
Activity Spreadsheet -- Enzyme Inhibition Constant Data from BindingDB
Found 2 hits for monomerid = 407455
TargetInterleukin-1 receptor-associated kinase 4(Homo sapiens (Human))
Gilead Sciences
US Patent
LigandPNGBDBM407455((R)-6-(3-cyanopyrrolo[1,2- b]pyridazin-7-yl)-N-(2-...)
Affinity DataIC50:  1nM. Assay description: Cryopreserved human monocytes (Stem Cell Technologies) were thawed, diluted in RPMI with GlutaMAX (GibcoŽ 200 mM L-alanyl-L-glutamine) (10 mM HEPES, ...
Ligand InfoPC cidPC sid
In DepthDetails US Patent
TargetTumor necrosis factor(Homo sapiens (Human))
Gilead Sciences
US Patent
LigandPNGBDBM407455((R)-6-(3-cyanopyrrolo[1,2- b]pyridazin-7-yl)-N-(2-...)
Affinity DataEC50:  30nM. Assay description: Cryopreserved human monocytes (Stem Cell Technologies) were thawed, diluted in RPMI with GlutaMAX (GibcoŽ 200 mM L-alanyl-L-glutamine) (10 mM HEPES, ...
Ligand InfoPC cidPC sid
In DepthDetails US Patent