BDBM408978 US10377744, Compound No. 1::US11123311, Compound 1::US11723929, Compound 1
SMILES FC(F)(F)Oc1ccc(NC(=O)NC2CCN(CC2)C(=O)C2CCOCC2)cc1
InChI Key InChIKey=OISHFYHRCHAYNK-UHFFFAOYSA-N
Data  4 KI
  Tab Delimited (TSV)   2D SDfile   Computed 3D by Vconf -m prep SDfile
Find this compound or compounds like it in BindingDB:
Activity Spreadsheet -- Enzyme Inhibition Constant Data from BindingDB
Found 4 hits for monomerid = 408978
TargetBifunctional epoxide hydrolase 2(Homo sapiens (Human))
The Regents Of The University Of California
US Patent
LigandPNGBDBM408978(US10377744, Compound No. 1 | US11123311, Compound ...)
Affinity DataKi:  1.40nM. Assay description: Any of a number of standard assays for determining epoxide hydrolase activity can be used to determine inhibition of sEH. For example, suitable assay...
Ligand InfoPC cidPC sid
In DepthDetails US Patent
TargetBifunctional epoxide hydrolase 2(Homo sapiens (Human))
The Regents Of The University Of California
US Patent
LigandPNGBDBM408978(US10377744, Compound No. 1 | US11123311, Compound ...)
Affinity DataKi:  1.40nM. Assay description: Inhibition of recombinant human sEH expressed in baculovirus expression system assessed as reduction in ACPU binding incubated for 1 hr by FRET displ...
Ligand InfoPC cidPC sid
In DepthDetails ArticlePubMed
TargetEpoxide hydrolase 1(Homo sapiens (Human))
The Regents Of The University Of California
US Patent
LigandPNGBDBM408978(US10377744, Compound No. 1 | US11123311, Compound ...)
Affinity DataKi:  1.43nM. Assay description: Scores of sEH inhibitors are known, of a variety of chemical structures. Derivatives in which the urea, carbamate or amide pharmacophore are particul...
Ligand InfoPC cidPC sid
In DepthDetails US Patent
TargetBifunctional epoxide hydrolase 2(Homo sapiens (Human))
The Regents Of The University Of California
US Patent
LigandPNGBDBM408978(US10377744, Compound No. 1 | US11123311, Compound ...)
Affinity DataKi:  1.43nM. Assay description: FRET assays to determine Ki for the compounds of Table I were carried out as described previously (Lee et al. Analytical Biochemistry 434 (2013) 259-...
Ligand InfoPC cidPC sid
In DepthDetails US Patent