BDBM409271 1-(Cyclobutylmethyl)-6-(4-fluoro-3-methyl-phenyl)pyrrolo[3,2-::US10377753, Example 173
SMILES Cc1cc(ccc1F)-c1cnc2ccn(CC3CCC3)c2c1
InChI Key InChIKey=MTXPFYDPXWYSJL-UHFFFAOYSA-N
Data  1 KI  5 IC50
  Tab Delimited (TSV)   2D SDfile   Computed 3D by Vconf -m prep SDfile
Find this compound or compounds like it in BindingDB:
Activity Spreadsheet -- Enzyme Inhibition Constant Data from BindingDB
Found 6 hits for monomerid = 409271
TargetPotassium voltage-gated channel subfamily H member 2(Homo sapiens (Human))
Janssen Research & Development
Curated by ChEMBL
LigandPNGBDBM409271(1-(Cyclobutylmethyl)-6-(4-fluoro-3-methyl-phenyl)p...)
Affinity DataKi:  1.10E+3nM. Assay description: Displacement of [3H]dofetilide from recombinant human ERG expressed in HEK293 cell membranes measured after 80 mins by TopCount scintillation analysi...
Ligand InfoPC cidPC sid
In DepthDetails ArticlePubMed
TargetCytochrome P450 1A2(Homo sapiens (Human))
Janssen Research & Development
Curated by ChEMBL
LigandPNGBDBM409271(1-(Cyclobutylmethyl)-6-(4-fluoro-3-methyl-phenyl)p...)
Affinity DataIC50:  400nM. Assay description: Inhibition of CYP1A2 in human liver microsomes
Ligand InfoPC cidPC sid
In DepthDetails ArticlePubMed
TargetCytochrome P450 2C9(Homo sapiens (Human))
Janssen Research & Development
Curated by ChEMBL
LigandPNGBDBM409271(1-(Cyclobutylmethyl)-6-(4-fluoro-3-methyl-phenyl)p...)
Affinity DataIC50:  2.60E+3nM. Assay description: Inhibition of CYP2C9 in human liver microsomes
Ligand InfoPC cidPC sid
In DepthDetails ArticlePubMed
TargetGlutamate receptor ionotropic, NMDA 1/2B(Homo sapiens (Human))
Janssen Research & Development
Curated by ChEMBL
LigandPNGBDBM409271(1-(Cyclobutylmethyl)-6-(4-fluoro-3-methyl-phenyl)p...)
Affinity DataIC50:  402nM. Assay description: Negative allosteric modulation of recombinant human GluN1a/GluN2B expressed in CHO-T-REx cells assessed as inhibition of glutamate/glycine-induced re...
Ligand InfoPC cidPC sid
In DepthDetails ArticlePubMed
TargetGlutamate receptor ionotropic, NMDA 2B(Homo sapiens (Human))
Janssen Pharmaceutica
US Patent
LigandPNGBDBM409271(1-(Cyclobutylmethyl)-6-(4-fluoro-3-methyl-phenyl)p...)
Affinity DataIC50:  63.1nM. Assay description: The assay depends on the binding of a tracer to the GluN2B subunit-containing NMDA receptors and the ability of the test compounds to displace such b...
Ligand InfoPC cidPC sid
In DepthDetails US Patent
TargetCytochrome P450 2C19(Homo sapiens (Human))
Janssen Research & Development
Curated by ChEMBL
LigandPNGBDBM409271(1-(Cyclobutylmethyl)-6-(4-fluoro-3-methyl-phenyl)p...)
Affinity DataIC50:  300nM. Assay description: Inhibition of CYP2C19 in human liver microsomes
Ligand InfoPC cidPC sid
In DepthDetails ArticlePubMed