BDBM410101 US10370370, Compound (R)-3
SMILES Clc1ccc2c(N[C@H]3CN4CCC3CC4)noc2c1
InChI Key InChIKey=WLVXTRCIWADVNT-LBPRGKRZSA-N
Data  1 KI
  Tab Delimited (TSV)   2D SDfile   Computed 3D by Vconf -m prep SDfile
Find this compound or compounds like it in BindingDB:
Activity Spreadsheet -- Enzyme Inhibition Constant Data from BindingDB
Found 1 hit for monomerid = 410101
Target5-hydroxytryptamine receptor 3A(Homo sapiens (Human))
Axovant Sciences
US Patent
LigandPNGBDBM410101(US10370370, Compound (R)-3)
Affinity DataKi:  57nM. Assay description: h-5HT3: In brief, Chinese Hamster Ovary (CHO) cells stably expressing human 5-HT3 serotonin receptors, grown to confluence in 175 cm2 flasks. Followi...
Ligand InfoPC cidPC sid
In DepthDetails US Patent