BDBM410109 US10370370, Compound 7-P2
SMILES COc1ccc2c(N[C@@H]3CN4CCC3CC4)noc2c1
InChI Key InChIKey=GMRSWLGFTCTQFO-CYBMUJFWSA-N
Data  2 KI
  Tab Delimited (TSV)   2D SDfile   Computed 3D by Vconf -m prep SDfile
Find this compound or compounds like it in BindingDB:
Activity Spreadsheet -- Enzyme Inhibition Constant Data from BindingDB
Found 2 hits for monomerid = 410109
Target5-hydroxytryptamine receptor 3A(Homo sapiens (Human))
Axovant Sciences
US Patent
LigandPNGBDBM410109(US10370370, Compound 7-P2)
Affinity DataKi:  32nM. Assay description: h-5HT3: In brief, Chinese Hamster Ovary (CHO) cells stably expressing human 5-HT3 serotonin receptors, grown to confluence in 175 cm2 flasks. Followi...
Ligand InfoPC cidPC sid
In DepthDetails US Patent
TargetNeuronal acetylcholine receptor subunit alpha-7(Homo sapiens (Human))
Axovant Sciences
US Patent
LigandPNGBDBM410109(US10370370, Compound 7-P2)
Affinity DataKi:  4.20E+3nM. Assay description: α7 nAChR: The ability of compounds to displace binding of radioactive ligands from human α7 nAChR was determined, as a measure of the affin...
Ligand InfoPC cidPC sid
In DepthDetails US Patent