BDBM410191 5-((2R,4S)-4-fluoro-2-(5-fluoro-1-methyl-2-oxo-1,2-dihydropyridin-3-yl)pyrrolidin-1-yl)pyrazolo[1,5-a]pyrimidine-3-carbonitrile ::US10370379, Compound 8::US11059827, Compound 8
SMILES Cn1cc(F)cc([C@H]2C[C@H](F)CN2c2ccn3ncc(C#N)c3n2)c1=O
InChI Key InChIKey=XVXFZZMJEOJTPY-GXTWGEPZSA-N
Data  2 IC50
  Tab Delimited (TSV)   2D SDfile   Computed 3D by Vconf -m prep SDfile
Find this compound or compounds like it in BindingDB:
Activity Spreadsheet -- Enzyme Inhibition Constant Data from BindingDB
Found 2 hits for monomerid = 410191
TargetHigh affinity nerve growth factor receptor(Homo sapiens (Human))
Blueprint Medicines
US Patent
LigandPNGBDBM410191(5-((2R,4S)-4-fluoro-2-(5-fluoro-1-methyl-2-oxo-1,2...)
Affinity DataIC50:  300nM. Assay description: In each well of a 384-well plate, 1 nM-1.5 nM of wild type NTRK1 enzyme (BPS Bioscience; 40280) was incubated in a total of 12.5 μL of buffer (1...
Ligand InfoPC cidPC sid
In DepthDetails US Patent
TargetHigh affinity nerve growth factor receptor(Homo sapiens (Human))
Blueprint Medicines
US Patent
LigandPNGBDBM410191(5-((2R,4S)-4-fluoro-2-(5-fluoro-1-methyl-2-oxo-1,2...)
Affinity DataIC50:  55nM. Assay description: In each well of a 384-well plate, 1 nM-1.5 nM of wild type NTRK1 enzyme (BPS Bioscience; 40280) was incubated in a total of 12.5 μL of buffer (1...
Ligand InfoPC cidPC sid
In DepthDetails US Patent