BDBM411181 N-Carbamoylmethyl-N-[4-(4-fluoro-2-methoxy-phenyl)-pyridin-3-yl]-2,6-bis-trifluoromethyl-isonicotinamide::US10385022, Example 177
SMILES COc1cc(F)ccc1-c1ccncc1N(CC(N)=O)C(=O)c1cc(nc(c1)C(F)(F)F)C(F)(F)F
InChI Key InChIKey=ZPXQVOFEZGPLCK-UHFFFAOYSA-N
Data  1 EC50
  Tab Delimited (TSV)   2D SDfile   Computed 3D by Vconf -m prep SDfile
Find this compound or compounds like it in BindingDB:
Activity Spreadsheet -- Enzyme Inhibition Constant Data from BindingDB
Found 1 hit for monomerid = 411181
TargetG-protein coupled bile acid receptor 1(Homo sapiens (Human))
Hoffmann-La Roche
US Patent
LigandPNGBDBM411181(N-Carbamoylmethyl-N-[4-(4-fluoro-2-methoxy-phenyl)...)
Affinity DataEC50:  36nM. Assay description: CHO-dhfr(minus) cells expressing human GPBAR1 receptors are seeded 17-24 hours prior to the experiment 50.000 cells per well in a black 96 well plate...
Ligand InfoPC cidPC sid
In DepthDetails US Patent