BDBM412245 (5S,6R)-5-(4-((S)-2- ((R)-3- (fluoromethyl)pyrrolidin- 1- yl)propoxy)phenyl)-6- phenyl-5,6,7,8- tetrahydronaphthalen- 2-ol::US10399939, Example 124
SMILES C[C@@H](COc1ccc(cc1)[C@@H]1[C@@H](CCc2cc(O)ccc12)c1ccccc1)N1CC[C@@H](CF)C1
InChI Key InChIKey=XQBKILUAMDIMEC-VZYCLNPTSA-N
Data  1 EC50
  Tab Delimited (TSV)   2D SDfile   Computed 3D by Vconf -m prep SDfile
Find this compound or compounds like it in BindingDB:
Activity Spreadsheet -- Enzyme Inhibition Constant Data from BindingDB
Found 1 hit for monomerid = 412245
TargetEstrogen receptor(Homo sapiens (Human))
Genentech
US Patent
LigandPNGBDBM412245((5S,6R)-5-(4-((S)-2- ((R)-3- (fluoromethyl)pyrroli...)
Affinity DataEC50:  0.0370nM. Assay description: The relative efficacies of Formula I compounds as inhibitors of an enzyme activity (or other biological activity) can be established by determining t...
Ligand Info
In DepthDetails US Patent