BDBM416535 US10307425, Example 1::US10632122, Example 1
SMILES CN1CCC(Cn2nc(-c3ccc4cc(OC5CCC5)ccc4c3)c3c(N)ncnc23)CC1
InChI Key InChIKey=ODHKSRGMQFROJU-UHFFFAOYSA-N
Data  5 IC50
  Tab Delimited (TSV)   2D SDfile   Computed 3D by Vconf -m prep SDfile
Find this compound or compounds like it in BindingDB:
Activity Spreadsheet -- Enzyme Inhibition Constant Data from BindingDB
Found 5 hits for monomerid = 416535
TargetCAM kinase, CDPK family TgCDPK1(Toxoplasma gondii (strain ATCC 50861 / VEG))
University Of Washington
US Patent
LigandPNGBDBM416535(US10307425, Example 1 | US10632122, Example 1)
Affinity DataIC50:  2.5nM. Assay description: Inhibitors were evaluated in triplicate in eight-point dilutions (3-fold dilutions) during the enzymatic reactions. TgCDPK1 enzymatic inhibition was ...
Ligand InfoPC cidPC sid
In DepthDetails US Patent
TargetCalmodulin-domain protein kinase 1(Toxoplasma gondii)
University Of Washington
US Patent
LigandPNGBDBM416535(US10307425, Example 1 | US10632122, Example 1)
Affinity DataIC50:  2.5nM. Assay description: Inhibitors were evaluated in triplicate in eight-point dilutions (3-fold dilutions) during the enzymatic reactions. TgCDPK1 enzymatic inhibition was ...
Ligand InfoPC cidPC sid
In DepthDetails US Patent
TargetPotassium voltage-gated channel subfamily H member 2(Homo sapiens (Human))
University Of Washington
Curated by ChEMBL
LigandPNGBDBM416535(US10307425, Example 1 | US10632122, Example 1)
Affinity DataIC50:  200nM. Assay description: Inhibition of human ERG
Ligand InfoPC cidPC sid
In DepthDetails ArticlePubMed
TargetProto-oncogene tyrosine-protein kinase Src(Gallus gallus (Chicken))
University Of Washington
Curated by ChEMBL
LigandPNGBDBM416535(US10307425, Example 1 | US10632122, Example 1)
Affinity DataIC50: >1.00E+4nM. Assay description: Inhibition of chicken Src using AcEIYGEFKKK as substrate after 90 mins in presence of ATP by luciferase reporter gene assay
Ligand InfoPC cidPC sid
In DepthDetails ArticlePubMed
TargetCalmodulin-domain protein kinase 1(Toxoplasma gondii)
University Of Washington
US Patent
LigandPNGBDBM416535(US10307425, Example 1 | US10632122, Example 1)
Affinity DataIC50:  2.5nM. Assay description: Inhibition of recombinant Toxoplasma gondii CDPK1 using Biotin-C6-PLARTLSVAGLPGKK as substrate after 90 mins in presence of ATP by luciferase reporte...
Ligand InfoPC cidPC sid
In DepthDetails ArticlePubMed