BDBM417675 2-(6-{5-chloro-2-[(oxan- 4-yl)amino]pyrimidin-4- yl}-1-oxo-2,3-dihydro- 1H-isoindol-2-yl)-N- [(2R)-1,1,1-trifluoro-3- hydroxypropan-2- yl]acetamide::US10457669, Example 294::US11001575, Example 294
SMILES OC[C@@H](NC(=O)CN1Cc2ccc(cc2C1=O)-c1nc(NC2CCOCC2)ncc1Cl)C(F)(F)F
InChI Key InChIKey=UTWZDTQAAOMRJA-QGZVFWFLSA-N
Data  2 IC50
  Tab Delimited (TSV)   2D SDfile   Computed 3D by Vconf -m prep SDfile
Find this compound or compounds like it in BindingDB:
Activity Spreadsheet -- Enzyme Inhibition Constant Data from BindingDB
Found 2 hits for monomerid = 417675
TargetMitogen-activated protein kinase 1(Homo sapiens (Human))
Otsuka Pharmaceutical
US Patent
LigandPNGBDBM417675(2-(6-{5-chloro-2-[(oxan- 4-yl)amino]pyrimidin-4- y...)
Affinity DataIC50:  2nM. Assay description: Activity of ERK2 enzyme (Life Technologies) was determined using a time-resolved fluorescence format measuring the phosphorylation of a truncated ver...
Ligand InfoPC cidPC sid
In DepthDetails US Patent
TargetMitogen-activated protein kinase 1(Homo sapiens (Human))
Otsuka Pharmaceutical
US Patent
LigandPNGBDBM417675(2-(6-{5-chloro-2-[(oxan- 4-yl)amino]pyrimidin-4- y...)
Affinity DataIC50:  2nM. Assay description: Activity of ERK2 enzyme (Life Technologies) was determined using a time-resolved fluorescence format measuring the phosphorylation of a truncated ver...
Ligand InfoPC cidPC sid
In DepthDetails US Patent