BDBM418177 2-[(1R)-5-{5-chloro-2-[(oxan-4- yl)amino]pyrimidin-4-yl}-1-methyl-3- oxo-2,3-dihydro-1H-isoindol-2-yl]-N- [(1S)-1-(3-fluoro-5-methoxyphenyl)-2- hydroxyethyl]acetamide::US10457669, Example 934::US11001575, Example 934
SMILES COc1cc(F)cc(c1)[C@@H](CO)NC(=O)CN1[C@H](C)c2ccc(cc2C1=O)-c1nc(NC2CCOCC2)ncc1Cl
InChI Key InChIKey=OVOROROZROZOFN-PUAOIOHZSA-N
Data  3 IC50
  Tab Delimited (TSV)   2D SDfile   Computed 3D by Vconf -m prep SDfile
Find this compound or compounds like it in BindingDB:
Activity Spreadsheet -- Enzyme Inhibition Constant Data from BindingDB
Found 3 hits for monomerid = 418177
TargetMitogen-activated protein kinase 1(Homo sapiens (Human))
Otsuka Pharmaceutical
US Patent
LigandPNGBDBM418177(2-[(1R)-5-{5-chloro-2-[(oxan-4- yl)amino]pyrimidin...)
Affinity DataIC50:  1.10nM. Assay description: Activity of ERK2 enzyme (Life Technologies) was determined using a time-resolved fluorescence format measuring the phosphorylation of a truncated ver...
Ligand InfoPC cidPC sid
In DepthDetails US Patent
TargetMitogen-activated protein kinase 1(Homo sapiens (Human))
Otsuka Pharmaceutical
US Patent
LigandPNGBDBM418177(2-[(1R)-5-{5-chloro-2-[(oxan-4- yl)amino]pyrimidin...)
Affinity DataIC50:  1.10nM. Assay description: Inhibition of full-length human N-terminal MAHHHHHH tagged-ERK2 expressed in Escherichia coli BL21 (DE3) using ATF2-GFP as substrate incubated for 30...
Ligand InfoPC cidPC sid
In DepthDetails ArticlePubMed
TargetMitogen-activated protein kinase 1(Homo sapiens (Human))
Otsuka Pharmaceutical
US Patent
LigandPNGBDBM418177(2-[(1R)-5-{5-chloro-2-[(oxan-4- yl)amino]pyrimidin...)
Affinity DataIC50:  1.10nM. Assay description: Activity of ERK2 enzyme (Life Technologies) was determined using a time-resolved fluorescence format measuring the phosphorylation of a truncated ver...
Ligand InfoPC cidPC sid
In DepthDetails US Patent