BDBM420257 (7S)-4-[(6-Methoxypyrazolo[1,5-a]pyridin-5-yl)amino]-N-methyl-N-(propan-2-yl)-5,6,7,8-tetrahydro[1]benzothieno[2,3-d]pyrimidine-7-carboxamide::US10487092, Example 105
SMILES COc1cn2nccc2cc1Nc1ncnc2sc3C[C@H](CCc3c12)C(=O)N(C)C(C)C
InChI Key InChIKey=OICUHWPRUCTFQY-AWEZNQCLSA-N
Data  1 IC50
  Tab Delimited (TSV)   2D SDfile   Computed 3D by Vconf -m prep SDfile
Find this compound or compounds like it in BindingDB:
Activity Spreadsheet -- Enzyme Inhibition Constant Data from BindingDB
Found 1 hit for monomerid = 420257
TargetIsoform 2 of MAP kinase-interacting serine/threonine-protein kinase 1 (MNK1a) 344D](Homo sapiens (Human))
Bayer Pharma Aktiengesellschaft
US Patent
LigandPNGBDBM420257((7S)-4-[(6-Methoxypyrazolo[1,5-a]pyridin-5-yl)amin...)
Affinity DataIC50:  2nM. Assay description: A recombinant fusion protein of Glutathione-S-Transferase (GST, N-terminally) and human full-length MKNK1 (amino acids 1-424 and T344D of accession n...
Ligand Info
In DepthDetails US Patent