BDBM420358 US10479784, Compound I-28::US10961232, Compound I-28
SMILES COc1ccccc1NC(=O)c1nc(cnc1N)-c1ccc(cc1)C(=O)N(C)C
InChI Key InChIKey=UXOQXISSTPVFOO-UHFFFAOYSA-N
Data  2 KI
  Tab Delimited (TSV)   2D SDfile   Computed 3D by Vconf -m prep SDfile
Find this compound or compounds like it in BindingDB:
Activity Spreadsheet -- Enzyme Inhibition Constant Data from BindingDB
Found 2 hits for monomerid = 420358
TargetSerine/threonine-protein kinase ATR(Homo sapiens (Human))
Vertex Pharmaceuticals
US Patent
LigandPNGBDBM420358(US10479784, Compound I-28 | US10961232, Compound I...)
Affinity DataKi: <10nM. Assay description: Compounds were screened for their ability to inhibit ATR kinase using a radioactive-phosphate incorporation assay. Assays were carried out in a mixtu...
Ligand Info
In DepthDetails US Patent
TargetSerine/threonine-protein kinase ATR(Homo sapiens (Human))
Vertex Pharmaceuticals
US Patent
LigandPNGBDBM420358(US10479784, Compound I-28 | US10961232, Compound I...)
Affinity DataKi: <10nM. Assay description: Compounds were screened for their ability to inhibit ATR kinase using a radioactive-phosphate incorporation assay. Assays were carried out in a mixtu...
Ligand Info
In DepthDetails US Patent