BDBM420478 US10479784, Compound I-147::US10961232, Compound I-147::tert-butyl 4-(4-(5-amino-6-(6-methyl-1H-benzo[d]imidazol-2-yl)pyrazin-2-yl)phenylcarbonyl)-1,4-diazepane-1-carboxylate
SMILES Cc1ccc2nc([nH]c2c1)-c1nc(cnc1N)-c1ccc(cc1)C(=O)N1CCCN(CC1)C(=O)OC(C)(C)C
InChI Key InChIKey=DAQMGKFZUBRNIB-UHFFFAOYSA-N
Data  2 KI
  Tab Delimited (TSV)   2D SDfile   Computed 3D by Vconf -m prep SDfile
Find this compound or compounds like it in BindingDB:
Activity Spreadsheet -- Enzyme Inhibition Constant Data from BindingDB
Found 2 hits for monomerid = 420478
TargetSerine/threonine-protein kinase ATR(Homo sapiens (Human))
Vertex Pharmaceuticals
US Patent
LigandPNGBDBM420478(US10479784, Compound I-147 | US10961232, Compound ...)
Affinity DataKi: <10nM. Assay description: Compounds were screened for their ability to inhibit ATR kinase using a radioactive-phosphate incorporation assay. Assays were carried out in a mixtu...
Ligand Info
In DepthDetails US Patent
TargetSerine/threonine-protein kinase ATR(Homo sapiens (Human))
Vertex Pharmaceuticals
US Patent
LigandPNGBDBM420478(US10479784, Compound I-147 | US10961232, Compound ...)
Affinity DataKi: <10nM. Assay description: Compounds were screened for their ability to inhibit ATR kinase using a radioactive-phosphate incorporation assay. Assays were carried out in a mixtu...
Ligand Info
In DepthDetails US Patent