BDBM420498 US10479784, Compound IA-14::US10961232, Compound IA-14
SMILES COCCN(C)C(=O)c1ccc(cc1)-c1cnc(N)c(n1)-c1nnc(o1)-c1ccccc1
InChI Key InChIKey=JFASWDFQIWAYJL-UHFFFAOYSA-N
Data  2 KI
  Tab Delimited (TSV)   2D SDfile   Computed 3D by Vconf -m prep SDfile
Find this compound or compounds like it in BindingDB:
Activity Spreadsheet -- Enzyme Inhibition Constant Data from BindingDB
Found 2 hits for monomerid = 420498
TargetSerine/threonine-protein kinase ATR(Homo sapiens (Human))
Vertex Pharmaceuticals
US Patent
LigandPNGBDBM420498(US10479784, Compound IA-14 | US10961232, Compound ...)
Affinity DataKi: <10nM. Assay description: Compounds were screened for their ability to inhibit ATR kinase using a radioactive-phosphate incorporation assay. Assays were carried out in a mixtu...
Ligand Info
In DepthDetails US Patent
TargetSerine/threonine-protein kinase ATR(Homo sapiens (Human))
Vertex Pharmaceuticals
US Patent
LigandPNGBDBM420498(US10479784, Compound IA-14 | US10961232, Compound ...)
Affinity DataKi: <10nM. Assay description: Compounds were screened for their ability to inhibit ATR kinase using a radioactive-phosphate incorporation assay. Assays were carried out in a mixtu...
Ligand Info
In DepthDetails US Patent