BDBM420622 4-[5-amino-6-(5-phenyl-1,3,4-oxadiazol-2-yl)pyrazin-2-yl]-3-(difluoromethyl)-N,N-dimethyl-benzamide ::US10479784, Compound IA-126::US10961232, Compound IA-126
SMILES CN(C)C(=O)c1ccc(-c2cnc(N)c(n2)-c2nnc(o2)-c2ccccc2)c(c1)C(F)F
InChI Key InChIKey=DFWSBYFYTWXHHJ-UHFFFAOYSA-N
Data  2 KI
  Tab Delimited (TSV)   2D SDfile   Computed 3D by Vconf -m prep SDfile
Find this compound or compounds like it in BindingDB:
Activity Spreadsheet -- Enzyme Inhibition Constant Data from BindingDB
Found 2 hits for monomerid = 420622
TargetSerine/threonine-protein kinase ATR(Homo sapiens (Human))
Vertex Pharmaceuticals
US Patent
LigandPNGBDBM420622(4-[5-amino-6-(5-phenyl-1,3,4-oxadiazol-2-yl)pyrazi...)
Affinity DataKi: <10nM. Assay description: Compounds were screened for their ability to inhibit ATR kinase using a radioactive-phosphate incorporation assay. Assays were carried out in a mixtu...
Ligand Info
In DepthDetails US Patent
TargetSerine/threonine-protein kinase ATR(Homo sapiens (Human))
Vertex Pharmaceuticals
US Patent
LigandPNGBDBM420622(4-[5-amino-6-(5-phenyl-1,3,4-oxadiazol-2-yl)pyrazi...)
Affinity DataKi: <10nM. Assay description: Compounds were screened for their ability to inhibit ATR kinase using a radioactive-phosphate incorporation assay. Assays were carried out in a mixtu...
Ligand Info
In DepthDetails US Patent