BDBM420667 5-(4-isopropylsulfonylphenyl)-3-[5-[2-methoxy-4-(methylaminomethyl)phenyl]-1,3,4-oxadiazol-2-yl]pyrazin-2-amine ::US10479784, Compound IA-171::US10961232, Compound IA-171
SMILES CNCc1ccc(-c2nnc(o2)-c2nc(cnc2N)-c2ccc(cc2)S(=O)(=O)C(C)C)c(OC)c1
InChI Key InChIKey=PRRDTMFNTZWJPS-UHFFFAOYSA-N
Data  2 KI
  Tab Delimited (TSV)   2D SDfile   Computed 3D by Vconf -m prep SDfile
Find this compound or compounds like it in BindingDB:
Activity Spreadsheet -- Enzyme Inhibition Constant Data from BindingDB
Found 2 hits for monomerid = 420667
TargetSerine/threonine-protein kinase ATR(Homo sapiens (Human))
Vertex Pharmaceuticals
US Patent
LigandPNGBDBM420667(5-(4-isopropylsulfonylphenyl)-3-[5-[2-methoxy-4-(m...)
Affinity DataKi: <10nM. Assay description: Compounds were screened for their ability to inhibit ATR kinase using a radioactive-phosphate incorporation assay. Assays were carried out in a mixtu...
Ligand Info
In DepthDetails US Patent
TargetSerine/threonine-protein kinase ATR(Homo sapiens (Human))
Vertex Pharmaceuticals
US Patent
LigandPNGBDBM420667(5-(4-isopropylsulfonylphenyl)-3-[5-[2-methoxy-4-(m...)
Affinity DataKi: <10nM. Assay description: Compounds were screened for their ability to inhibit ATR kinase using a radioactive-phosphate incorporation assay. Assays were carried out in a mixtu...
Ligand Info
In DepthDetails US Patent