BDBM422049 US10508102, Compound E
SMILES CC(=O)N[C@@H](Cc1c[nH]c2c(Cl)c(F)ccc12)C(O)=O
InChI Key
Data  2 EC50
  Tab Delimited (TSV)   2D SDfile   Computed 3D by Vconf -m prep SDfile
Find this compound or compounds like it in BindingDB:
Activity Spreadsheet -- Enzyme Inhibition Constant Data from BindingDB
Found 2 hits for monomerid = 422049
TargetTumor necrosis factor(Homo sapiens (Human))
President and Fellows of Harvard College
US Patent
LigandPNGBDBM422049(US10508102, Compound E)
Affinity DataEC50:  8.33E+3nM. Assay description: Compound (Ia) was prepared according to the general methods described above. Compound (Ia) and compound A (below) were screened for anti-necrotic act...
Ligand InfoKEGGPC cidPC sid
In DepthDetails US Patent
TargetTumor necrosis factor(Homo sapiens (Human))
President and Fellows of Harvard College
US Patent
LigandPNGBDBM422049(US10508102, Compound E)
Affinity DataEC50:  2.33E+3nM. Assay description: Compound (Ia) was prepared according to the general methods described above. Compound (Ia) and compound A (below) were screened for anti-necrotic act...
Ligand InfoKEGGPC cidPC sid
In DepthDetails US Patent