BDBM422122 2-butyl-1-(2,6- dimethoxyphenyl)-5-[4- (6-fluoropyridin-3- yl)benzenesulfonyl]-6- hydroxy-1,4- dihydropyrimidin-4-one::US10508104, Example 15
SMILES CCCCc1nc(=O)c(c(O)n1-c1c(OC)cccc1OC)S(=O)(=O)c1ccc(cc1)-c1ccc(F)nc1
InChI Key InChIKey=MIPVYTQOFVYDOJ-UHFFFAOYSA-N
Data  4 EC50
  Tab Delimited (TSV)   2D SDfile   Computed 3D by Vconf -m prep SDfile
Find this compound or compounds like it in BindingDB:
Activity Spreadsheet -- Enzyme Inhibition Constant Data from BindingDB
Found 4 hits for monomerid = 422122
TargetApelin receptor(Homo sapiens (Human))
Bristol-Myers Squibb
US Patent
LigandPNGBDBM422122(2-butyl-1-(2,6- dimethoxyphenyl)-5-[4- (6-fluoropy...)
Affinity DataEC50:  5nM. Assay description: HEK293 cells stably expressing human APJ receptor were used to assess the activity of compounds. Cultured cells were detached and resuspended in the ...
Ligand InfoPC cidPC sid
In DepthDetails US Patent
TargetApelin receptor(Mus musculus)
Bristol-Myers Squibb
Curated by ChEMBL
LigandPNGBDBM422122(2-butyl-1-(2,6- dimethoxyphenyl)-5-[4- (6-fluoropy...)
Affinity DataEC50:  0.0200nM. Assay description: Agonist activity at mouse APJ receptor assessed as effect on cAMP accumulation by cAMP-Glo assay
Ligand InfoPC cidPC sid
In DepthDetails ArticlePubMed
TargetApelin receptor(Rattus norvegicus)
Bristol-Myers Squibb
Curated by ChEMBL
LigandPNGBDBM422122(2-butyl-1-(2,6- dimethoxyphenyl)-5-[4- (6-fluoropy...)
Affinity DataEC50:  0.00400nM. Assay description: Agonist activity at rat APJ receptor assessed as effect on cAMP accumulation by cAMP-Glo assay
Ligand InfoPC cidPC sid
In DepthDetails ArticlePubMed
TargetApelin receptor(Homo sapiens (Human))
Bristol-Myers Squibb
US Patent
LigandPNGBDBM422122(2-butyl-1-(2,6- dimethoxyphenyl)-5-[4- (6-fluoropy...)
Affinity DataEC50:  0.00200nM. Assay description: Agonist activity at human APJ receptor assessed as effect on cAMP accumulation by cAMP-Glo assay
Ligand InfoPC cidPC sid
In DepthDetails ArticlePubMed