BDBM422664 US10508105, Compound 13
SMILES Cn1nc(OCC(F)(F)F)c2ccc(Nc3n[nH]c4cccnc34)cc12
InChI Key InChIKey=BACQZYOKQKGKME-UHFFFAOYSA-N
Data  1 EC50
  Tab Delimited (TSV)   2D SDfile   Computed 3D by Vconf -m prep SDfile
Find this compound or compounds like it in BindingDB:
Activity Spreadsheet -- Enzyme Inhibition Constant Data from BindingDB
Found 1 hit for monomerid = 422664
TargetMetabotropic glutamate receptor 4(Homo sapiens (Human))
Vanderbilt University
US Patent
LigandPNGBDBM422664(US10508105, Compound 13)
Affinity DataEC50:  175nM. Assay description: The disclosed compounds and compositions can be evaluated for their ability to act as a potentiatior of metabotropic glutamate receptor activity, in ...
Ligand InfoPC cidPC sid
In DepthDetails US Patent