BDBM42275 2-(3-Cyclopropanecarbonyl-indol-1-yl)-N-(3-methoxy-propyl)-acetamide::2-(3-cyclopropylcarbonylindol-1-yl)-N-(3-methoxypropyl)ethanamide::2-[3-(cyclopropanecarbonyl)indol-1-yl]-N-(3-methoxypropyl)acetamide::2-[3-[cyclopropyl(oxo)methyl]-1-indolyl]-N-(3-methoxypropyl)acetamide::MLS000033991::SMR000014346::cid_648985
SMILES COCCCNC(=O)Cn1cc(C(=O)C2CC2)c2ccccc12
InChI Key InChIKey=XLXYRBAJDVPLEG-UHFFFAOYSA-N
Data  1 EC50
  Tab Delimited (TSV)   2D SDfile   Computed 3D by Vconf -m prep SDfile
Find this compound or compounds like it in BindingDB:
Activity Spreadsheet -- Enzyme Inhibition Constant Data from BindingDB
Found 1 hit for monomerid = 42275
TargetLysosomal acid glucosylceramidase(Homo sapiens (Human))
The Scripps Research Institute Molecular Screening Center
Curated by PubChem BioAssay
LigandPNGBDBM42275(2-(3-Cyclopropanecarbonyl-indol-1-yl)-N-(3-methoxy...)
Affinity DataEC50: >5.00E+4nM. Assay description: Source (MLSCN Center Name): The Scripps Research Institute Molecular Screening Center Center Affiliation: The Scripps Research Institute, TSRI Assay ...
In DepthDetails PCBioAssay