BDBM42283 2-(4-Benzylamino-4H-[1,2,4]triazol-3-ylsulfanyl)-N-tert-butyl-acetamide::2-[[4-(benzylamino)-1,2,4-triazol-3-yl]sulfanyl]-N-tert-butylacetamide::2-[[4-(benzylamino)-1,2,4-triazol-3-yl]thio]-N-tert-butyl-acetamide::MLS000034273::N-tert-butyl-2-[[4-[(phenylmethyl)amino]-1,2,4-triazol-3-yl]sulfanyl]ethanamide::N-tert-butyl-2-[[4-[(phenylmethyl)amino]-1,2,4-triazol-3-yl]thio]acetamide::SMR000014148::cid_653197
SMILES CC(C)(C)NC(=O)CSc1nncn1NCc1ccccc1
InChI Key InChIKey=HTYMZKCBFICSDS-UHFFFAOYSA-N
Data  1 EC50
  Tab Delimited (TSV)   2D SDfile   Computed 3D by Vconf -m prep SDfile
Find this compound or compounds like it in BindingDB:
Activity Spreadsheet -- Enzyme Inhibition Constant Data from BindingDB
Found 1 hit for monomerid = 42283
TargetLysosomal acid glucosylceramidase(Homo sapiens (Human))
The Scripps Research Institute Molecular Screening Center
Curated by PubChem BioAssay
LigandPNGBDBM42283(2-(4-Benzylamino-4H-[1,2,4]triazol-3-ylsulfanyl)-N...)
Affinity DataEC50: >5.00E+4nM. Assay description: Source (MLSCN Center Name): The Scripps Research Institute Molecular Screening Center Center Affiliation: The Scripps Research Institute, TSRI Assay ...
In DepthDetails PCBioAssay