BDBM42292 MLS000031848::N-tert-Butyl-2-(5-furan-2-yl-4-furan-2-ylmethyl-4H-[1,2,4]triazol-3-ylsulfanyl)-acetamide::N-tert-butyl-2-[[4-(2-furfuryl)-5-(2-furyl)-1,2,4-triazol-3-yl]thio]acetamide::N-tert-butyl-2-[[5-(2-furanyl)-4-(2-furanylmethyl)-1,2,4-triazol-3-yl]thio]acetamide::N-tert-butyl-2-[[5-(furan-2-yl)-4-(furan-2-ylmethyl)-1,2,4-triazol-3-yl]sulfanyl]acetamide::N-tert-butyl-2-[[5-(furan-2-yl)-4-(furan-2-ylmethyl)-1,2,4-triazol-3-yl]sulfanyl]ethanamide::SMR000002849::cid_655446
SMILES CC(C)(C)NC(=O)CSc1nnc(-c2ccco2)n1Cc1ccco1
InChI Key InChIKey=TVPPOVOXHDIISQ-UHFFFAOYSA-N
Data  1 EC50
  Tab Delimited (TSV)   2D SDfile   Computed 3D by Vconf -m prep SDfile
Find this compound or compounds like it in BindingDB:
Activity Spreadsheet -- Enzyme Inhibition Constant Data from BindingDB
Found 1 hit for monomerid = 42292
TargetLysosomal acid glucosylceramidase(Homo sapiens (Human))
The Scripps Research Institute Molecular Screening Center
Curated by PubChem BioAssay
LigandPNGBDBM42292(MLS000031848 | N-tert-Butyl-2-(5-furan-2-yl-4-fura...)
Affinity DataEC50: >5.00E+4nM. Assay description: Source (MLSCN Center Name): The Scripps Research Institute Molecular Screening Center Center Affiliation: The Scripps Research Institute, TSRI Assay ...
In DepthDetails PCBioAssay