BDBM423160 6-(1,5-dimethyl-6-oxo-3-pyridyl)-8-(3-pyridylamino)-3,4-dihydro-1H-quinolin-2-one::US10501438, Compound 11
SMILES Cc1cc(cn(C)c1=O)-c1cc2CCC(=O)Nc2c(Nc2cccnc2)c1
InChI Key InChIKey=ILFHDQXFOCXZBP-UHFFFAOYSA-N
Data  1 IC50
  Tab Delimited (TSV)   2D SDfile   Computed 3D by Vconf -m prep SDfile
Find this compound or compounds like it in BindingDB:
Activity Spreadsheet -- Enzyme Inhibition Constant Data from BindingDB
Found 1 hit for monomerid = 423160
TargetBromodomain-containing protein 4(Homo sapiens (Human))
Neomed Institute
US Patent
LigandPNGBDBM423160(6-(1,5-dimethyl-6-oxo-3-pyridyl)-8-(3-pyridylamino...)
Affinity DataIC50:  350nM. Assay description: To measure activity of bromodomain inhibitors, a His-epitope tagged BRD4 BD149-170 is purchased from BPS Bioscience. BRD4 binding and inhibition is a...
Ligand InfoPC cidPC sid
In DepthDetails US Patent