BDBM423163 6-(1,5-dimethyl-6-oxo-3-pyridyl)-8-(N-methylanilino)-3,4-dihydro-1H-quinolin-2-one::US10501438, Compound 14
SMILES CN(c1ccccc1)c1cc(cc2CCC(=O)Nc12)-c1cc(C)c(=O)n(C)c1
InChI Key InChIKey=XUJMGPFLQDEZTE-UHFFFAOYSA-N
Data  1 IC50
  Tab Delimited (TSV)   2D SDfile   Computed 3D by Vconf -m prep SDfile
Find this compound or compounds like it in BindingDB:
Activity Spreadsheet -- Enzyme Inhibition Constant Data from BindingDB
Found 1 hit for monomerid = 423163
TargetBromodomain-containing protein 4(Homo sapiens (Human))
Neomed Institute
US Patent
LigandPNGBDBM423163(6-(1,5-dimethyl-6-oxo-3-pyridyl)-8-(N-methylanilin...)
Affinity DataIC50:  350nM. Assay description: To measure activity of bromodomain inhibitors, a His-epitope tagged BRD4 BD149-170 is purchased from BPS Bioscience. BRD4 binding and inhibition is a...
Ligand InfoPC cidPC sid
In DepthDetails US Patent