BDBM426897 (2,2-Dimethyl-1,3-dioxolan-4-yl)methyl 4-[2-(4-fluorophenyl)-4-oxo-1,3-thiazolidin-3-yl]-3-methylbenzoate::US10544113, No. 208
SMILES Cc1cc(c(C)cc1Cl)S(=O)(=O)NC(=O)c1ccc(N2C(SCC2=O)c2ccc(F)cc2)c(C)c1
InChI Key InChIKey=TUXKQEHDUBIXIK-UHFFFAOYSA-N
Data  1 EC50
  Tab Delimited (TSV)   2D SDfile   Computed 3D by Vconf -m prep SDfile
Find this compound or compounds like it in BindingDB:
Activity Spreadsheet -- Enzyme Inhibition Constant Data from BindingDB
Found 1 hit for monomerid = 426897
Target5-hydroxytryptamine receptor 7(Homo sapiens (Human))
National Health Research Institute
US Patent
LigandPNGBDBM426897((2,2-Dimethyl-1,3-dioxolan-4-yl)methyl 4-[2-(4-flu...)
Affinity DataEC50:  400nM. Assay description: One day before the assay, CORNING black with clear flat bottom 96-well assay plates were coated with a 0.1 mg/mL Poly-L-Lysine solution. CHO-K1/MOR/G...
Ligand InfoPC cidPC sid
In DepthDetails US Patent