BDBM427038 US10544117, Entry 230071::US11192871, Example 230071
SMILES CCC1(CC)CC(CCN2CCc3ccc(F)cc3C2)OC1=O
InChI Key InChIKey=CIFWGLUEYBSOCJ-UHFFFAOYSA-N
Data  2 IC50
  Tab Delimited (TSV)   2D SDfile   Computed 3D by Vconf -m prep SDfile
Find this compound or compounds like it in BindingDB:
Activity Spreadsheet -- Enzyme Inhibition Constant Data from BindingDB
Found 2 hits for monomerid = 427038
Target5-hydroxytryptamine receptor 7(Homo sapiens (Human))
Temple University-Of The Commonwealth System Of Higher Education
US Patent
LigandPNGBDBM427038(US10544117, Entry 230071 | US11192871, Example 230...)
Affinity DataIC50:  9.90nM. Assay description: A stock concentration of 5 nM [3H]-5-Hydroxytryptamine ([3H]-5HT) is prepared in 50 mM Tris-HCl, 10 mM MgCl2, 1 mM EDTA, pH 7.4 (Assay Buffer). Aliqu...
Ligand InfoPC cidPC sid
Target5-hydroxytryptamine receptor 7(Homo sapiens (Human))
Temple University-Of The Commonwealth System Of Higher Education
US Patent
LigandPNGBDBM427038(US10544117, Entry 230071 | US11192871, Example 230...)
Affinity DataIC50:  9.90nM. Assay description: A solution of the compound of the disclosure to be tested is prepared as a 1-mg/ml stock in Assay Buffer or DMSO according to its solubility. A simil...
Ligand InfoPC cidPC sid
In DepthDetails US Patent