BDBM4320 2-[(4-hydroxy-3,5-dimethoxyphenyl)methylidene]propanedinitrile::benzylidenemalononitrile (BMN) deriv. 4
SMILES [#6]-[#8]-c1cc(\[#6]=[#6](/C#N)C#N)cc(-[#8]-[#6])c1-[#8]
InChI Key InChIKey=ZEGOLZJKCSVYBM-UHFFFAOYSA-N
Data  1 KI  1 IC50
  Tab Delimited (TSV)   2D SDfile   Computed 3D by Vconf -m prep SDfile
Find this compound or compounds like it in BindingDB:
Activity Spreadsheet -- Enzyme Inhibition Constant Data from BindingDB
Found 1 hit for monomerid = 4320
TargetEpidermal growth factor receptor(Homo sapiens (Human))
Hebrew University of Jerusalem
LigandPNGBDBM4320(2-[(4-hydroxy-3,5-dimethoxyphenyl)methylidene]prop...)
Affinity DataKi:  3.00E+5nM ΔG°:  -4.75kcal/mole IC50:  8.50E+5nMpH: 7.6 T: 2°C. Assay description: The activity of EGFR, preactivated with EGF, is measured by its ability to transfer terminal phosphate from [gamma-32P]ATP to poly(GAT) substrate.
In DepthDetails ArticlePubMed