BDBM433069 N-((2S,4S)-1-(((1r,4S)-4- aminocyclohexyl)sulfonyl)-2- methylpiperidin-4-yl)-5- cyclopropylisoxazole-3-carboxamide::US10577363, Compound 773
SMILES C[C@H]1C[C@H](CCN1S(=O)(=O)[C@H]1CC[C@H](N)CC1)NC(=O)c1cc(on1)C1CC1
InChI Key InChIKey=YENGJMDEDDIJKF-TUUVXOQKSA-N
Data  1 IC50
  Tab Delimited (TSV)   2D SDfile   Computed 3D by Vconf -m prep SDfile
Find this compound or compounds like it in BindingDB:
Activity Spreadsheet -- Enzyme Inhibition Constant Data from BindingDB
Found 1 hit for monomerid = 433069
TargetHistone-lysine N-methyltransferase SMYD3(Homo sapiens (Human))
Epizyme
US Patent
LigandPNGBDBM433069(N-((2S,4S)-1-(((1r,4S)-4- aminocyclohexyl)sulfonyl...)
Affinity DataIC50:  1.03nM. Assay description: The assays were all performed in a buffer consisting of 25 mM Tris-Cl pH 8.0, 1 mM TCEP, 0.005% BSG, and 0.005% Tween 20, prepared on the day of use....
Ligand InfoPC cidPC sid
In DepthDetails US Patent