BDBM433474 US10562853, Compound 1
SMILES Fc1ccc(cc1Cl)C(=O)N1CCC(F)(CNCCOc2ccccc2)CC1
InChI Key InChIKey=DXWRIDGYFFSIIY-UHFFFAOYSA-N
Data  9 KI  8 EC50
  Tab Delimited (TSV)   2D SDfile   Computed 3D by Vconf -m prep SDfile
Find this compound or compounds like it in BindingDB:
Activity Spreadsheet -- Enzyme Inhibition Constant Data from BindingDB
Found 17 hits for monomerid = 433474
Target5-hydroxytryptamine receptor 1A(Homo sapiens (Human))
Neurolixis
US Patent
LigandPNGBDBM433474(US10562853, Compound 1)
Affinity DataKi:  0.0610nM. Assay description: 5-HT1A: Radioligand binding was performed using membranes from CHO-K1 cells stably transfected with the human 5-HT1A receptor. All assays were carrie...
Ligand InfoPC cidPC sid
In DepthDetails US Patent
Target5-hydroxytryptamine receptor 1A(Homo sapiens (Human))
Neurolixis
US Patent
LigandPNGBDBM433474(US10562853, Compound 1)
Affinity DataKi:  0.0617nM. Assay description: Displacement of [3H]8-OH-DPAT from human 5-HT1A receptor stably expressed in CHO-K1 cell membranes measured after 60 mins by Microbeta2 scintillation...
Ligand InfoPC cidPC sid
In DepthDetails PubMed
Target5-hydroxytryptamine receptor 1A(Homo sapiens (Human))
Neurolixis
US Patent
LigandPNGBDBM433474(US10562853, Compound 1)
Affinity DataKi:  0.0617nM. Assay description: Displacement of [3H]8-OH-DPAT from recombinant human 5HT1A receptor stably expressed in CHO-K1 cell membranes measured after 60 mins by microbeta2 sc...
Ligand InfoPC cidPC sid
In DepthDetails ArticlePubMed
TargetAlpha-1A adrenergic receptor(Homo sapiens (Human))
Neurolixis
US Patent
LigandPNGBDBM433474(US10562853, Compound 1)
Affinity DataKi:  380nM. Assay description: Alpha1-adrenergic Receptor: Radioligand binding was performed using tissue (rat cortex). All assays were carried out in duplicates. 50 μL workin...
Ligand InfoPC cidPC sid
In DepthDetails US Patent
TargetAlpha-1A/Alpha-1B/Alpha-1D adrenergic receptor(Rattus norvegicus (rat))
Jagiellonian University Medical College
Curated by ChEMBL
LigandPNGBDBM433474(US10562853, Compound 1)
Affinity DataKi:  513nM. Assay description: Displacement of [3H]-prazosin from alpha1 adrenergic receptor in rat cortex measured after 30 mins by microbeta2 scintillation counting method
Ligand InfoPC cidPC sid
In DepthDetails ArticlePubMed
TargetAlpha-1A/Alpha-1B/Alpha-1D adrenergic receptor(Rattus norvegicus (rat))
Jagiellonian University Medical College
Curated by ChEMBL
LigandPNGBDBM433474(US10562853, Compound 1)
Affinity DataKi:  513nM. Assay description: Displacement of [3H]prazosin from alpha1 adrenergic receptor in rat cortex membranes measured after 30 mins by Microbeta2 scintillation counting meth...
Ligand InfoPC cidPC sid
In DepthDetails PubMed
TargetD(2) dopamine receptor(Homo sapiens (Human))
Jagiellonian University Medical College
Curated by ChEMBL
LigandPNGBDBM433474(US10562853, Compound 1)
Affinity DataKi: <1.00E+3nM. Assay description: Displacement of [3H]-methylspiperone from recombinant human D2 receptor stably expressed in CHO-K1 cell membranes measured after 60 mins by microbeta...
Ligand InfoPC cidPC sid
In DepthDetails ArticlePubMed
TargetD(2) dopamine receptor(Homo sapiens (Human))
Jagiellonian University Medical College
Curated by ChEMBL
LigandPNGBDBM433474(US10562853, Compound 1)
Affinity DataKi: <1.00E+3nM. Assay description: Displacement of [3H]methylspiperone from human D2 receptor stably expressed in CHO-K1 cell membranes measured after 60 mins by Microbeta2 scintillati...
Ligand InfoPC cidPC sid
In DepthDetails PubMed
TargetD(2) dopamine receptor(Homo sapiens (Human))
Jagiellonian University Medical College
Curated by ChEMBL
LigandPNGBDBM433474(US10562853, Compound 1)
Affinity DataKi: >1.00E+3nM. Assay description: D2 Dopamine Receptor:Radioligand binding was performed using membranes from CHO-K1 cells stably transfected with the human D2 receptor. All assays we...
Ligand InfoPC cidPC sid
In DepthDetails US Patent
Target5-hydroxytryptamine receptor 1A(Homo sapiens (Human))
Neurolixis
US Patent
LigandPNGBDBM433474(US10562853, Compound 1)
Affinity DataEC50:  10nM. Assay description: Biased agonist activity at Gal4-VP16 transcription factor linked human 5-HT1A receptor expressed in human U2OS cells assessed as induction of beta-ar...
Ligand InfoPC cidPC sid
In DepthDetails PubMed
Target5-hydroxytryptamine receptor 1A(Homo sapiens (Human))
Neurolixis
US Patent
LigandPNGBDBM433474(US10562853, Compound 1)
Affinity DataEC50:  8.10nM. Assay description: Biased agonist activity at human 5-HT1A receptor stably expressed in CHO-K1 cells assessed as inhibition of forskolin-induced cAMP accumulation after...
Ligand InfoPC cidPC sid
In DepthDetails PubMed
Target5-hydroxytryptamine receptor 1A(Homo sapiens (Human))
Neurolixis
US Patent
LigandPNGBDBM433474(US10562853, Compound 1)
Affinity DataEC50:  0.794nM. Assay description: Biased agonist activity at human 5-HT1A receptor stably expressed in CHO-K1 cells assessed as increase in ERK1/2 phosphorylation after 15 mins by Alp...
Ligand InfoPC cidPC sid
In DepthDetails PubMed
Target5-hydroxytryptamine receptor 1A(Homo sapiens (Human))
Neurolixis
US Patent
LigandPNGBDBM433474(US10562853, Compound 1)
Affinity DataEC50:  41nM. Assay description: Biased agonist activity at human recombinant 5-HT1A receptor stably expressed in CHO-K1 cells assessed as increase in calcium mobilization measured a...
Ligand InfoPC cidPC sid
In DepthDetails ArticlePubMed
Target5-hydroxytryptamine receptor 1A(Homo sapiens (Human))
Neurolixis
US Patent
LigandPNGBDBM433474(US10562853, Compound 1)
Affinity DataEC50:  63nM. Assay description: Biased agonist activity at human 5-HT1A receptor stably expressed in CHO-K1 cells co-expressing Galpha16/GPCR assessed as increase in calcium mobiliz...
Ligand InfoPC cidPC sid
In DepthDetails PubMed
Target5-hydroxytryptamine receptor 1A(Homo sapiens (Human))
Neurolixis
US Patent
LigandPNGBDBM433474(US10562853, Compound 1)
Affinity DataEC50:  8.10nM. Assay description: Biased agonist activity at human recombinant 5-HT1A receptor stably expressed in CHO-K1 cells assessed as inhibition of forskolin-induced cAMP accumu...
Ligand InfoPC cidPC sid
In DepthDetails ArticlePubMed
Target5-hydroxytryptamine receptor 1A(Homo sapiens (Human))
Neurolixis
US Patent
LigandPNGBDBM433474(US10562853, Compound 1)
Affinity DataEC50:  0.794nM. Assay description: Biased agonist activity at human recombinant 5-HT1A receptor stably expressed in CHO-K1 cells assessed as increase in ERK1/2 phosphorylation levels i...
Ligand InfoPC cidPC sid
In DepthDetails ArticlePubMed
Target5-hydroxytryptamine receptor 1A(Homo sapiens (Human))
Neurolixis
US Patent
LigandPNGBDBM433474(US10562853, Compound 1)
Affinity DataEC50:  10nM. Assay description: Biased agonist activity at Gal4-VP16 transcription factor linked human 5-HT1A receptor expressed in human U2OS cells assessed as stimulation of beta-...
Ligand InfoPC cidPC sid
In DepthDetails ArticlePubMed