BDBM43476 1-methyl-4-[(2,3,4,5-tetrachloro-1-cyclopenta-2,4-dienylidene)methyl]benzene::1-methyl-4-[(2,3,4,5-tetrachlorocyclopenta-2,4-dien-1-ylidene)methyl]benzene::1-methyl-4-[[2,3,4,5-tetrakis(chloranyl)cyclopenta-2,4-dien-1-ylidene]methyl]benzene::MLS000738051::SMR000393724::cid_230812
SMILES [#6]-c1ccc(\[#6]=[#6]-2\[#6](Cl)=[#6](Cl)-[#6](Cl)=[#6]-2Cl)cc1
InChI Key InChIKey=GLCNSQWOANYMNW-UHFFFAOYSA-N
Data  4 EC50
  Tab Delimited (TSV)   2D SDfile   Computed 3D by Vconf -m prep SDfile
Find this compound or compounds like it in BindingDB:
Activity Spreadsheet -- Enzyme Inhibition Constant Data from BindingDB
Found 4 hits for monomerid = 43476
TargetE3 ubiquitin-protein ligase Mdm2(Homo sapiens (Human))
Pcmd
Curated by PubChem BioAssay
LigandPNGBDBM43476(1-methyl-4-[(2,3,4,5-tetrachloro-1-cyclopenta-2,4-...)
Affinity DataEC50:  780nM. Assay description: Molecular Library Screening Center Network (MLSCN) Penn Center for Molecular Discovery (PCMD) Assay Provider: Brent Stockwell, Columbia University ML...
In DepthDetails PCBioAssay
TargetBcl-2-like protein 11(Homo sapiens (Human))
Broad Institute
Curated by PubChem BioAssay
LigandPNGBDBM43476(1-methyl-4-[(2,3,4,5-tetrachloro-1-cyclopenta-2,4-...)
Affinity DataEC50:  7.19E+3nM. Assay description: Keywords: apoptosis, BH3 domain, Bcl2-A1, BIM, caspase, cancer Primary Collaborator: Todd Golub, Broad Institute, golub@broadinstitute.org Assay Over...
In DepthDetails PCBioAssay
TargetE3 ubiquitin-protein ligase Mdm2(Homo sapiens (Human))
Pcmd
Curated by PubChem BioAssay
LigandPNGBDBM43476(1-methyl-4-[(2,3,4,5-tetrachloro-1-cyclopenta-2,4-...)
Affinity DataEC50:  1.06E+3nM. Assay description: Molecular Library Screening Center Network (MLSCN) Penn Center for Molecular Discovery (PCMD) Assay Provider: Brent Stockwell, Columbia University ML...
In DepthDetails PCBioAssay
TargetE3 ubiquitin-protein ligase Mdm2(Homo sapiens (Human))
Pcmd
Curated by PubChem BioAssay
LigandPNGBDBM43476(1-methyl-4-[(2,3,4,5-tetrachloro-1-cyclopenta-2,4-...)
Affinity DataEC50:  6.36E+9nM. Assay description: Molecular Library Screening Center Network (MLSCN) Penn Center for Molecular Discovery (PCMD) Assay Provider: Brent Stockwell, Columbia University ML...
In DepthDetails PCBioAssay