BDBM436043 2-(2-chloro-5-fluorophenyl)-1- ((1S,3R)-3-(hydroxymethyl)-1- methyl-5-(1H-pyrazol-4-yl)- 3,4-dihydroisoquinolin-2(1H)- yl)ethan-1-one::US10611751, Example 11
SMILES C[C@@H]1N([C@@H](CO)Cc2c1cccc2-c1cn[nH]c1)C(=O)Cc1cc(F)ccc1Cl
InChI Key
Data  2 EC50
  Tab Delimited (TSV)   2D SDfile   Computed 3D by Vconf -m prep SDfile
Find this compound or compounds like it in BindingDB:
Activity Spreadsheet -- Enzyme Inhibition Constant Data from BindingDB
Found 2 hits for monomerid = 436043
TargetD(1A) dopamine receptor(Homo sapiens (Human))
Arrival Discovery
Curated by ChEMBL
LigandPNGBDBM436043(2-(2-chloro-5-fluorophenyl)-1- ((1S,3R)-3-(hydroxy...)
Affinity DataEC50:  112nM. Assay description: Positive allosteric modulation of human D1 receptor expressed in HEK293 assessed as cAMP production incubated for 60 mins by HTRF assay
Ligand InfoPC cidPC sid
In DepthDetails ArticlePubMed
TargetD(1A) dopamine receptor(Homo sapiens (Human))
Arrival Discovery
Curated by ChEMBL
LigandPNGBDBM436043(2-(2-chloro-5-fluorophenyl)-1- ((1S,3R)-3-(hydroxy...)
Affinity DataEC50:  112nM. Assay description: The PAM activity of the compounds of the present invention may be measured essentially as described in Svensson et al., An Allosteric Potentiator of ...
Ligand InfoPC cidPC sid
In DepthDetails US Patent