BDBM436106 4-(((3S,4S)-4-(aminomethyl)-1-((5-chloropyridin-2-yl)sulfonyl)-4-hydroxypyrrolidin-3-yl)methyl)-2-fluorobenzonitrile::US10590077, Example 7
SMILES NC[C@]1(O)CN(C[C@@H]1Cc1ccc(C#N)c(F)c1)S(=O)(=O)c1ccc(Cl)cn1
InChI Key InChIKey=HLJMSDGALLNUHU-KSSFIOAISA-N
Data  1 IC50
  Tab Delimited (TSV)   2D SDfile   Computed 3D by Vconf -m prep SDfile
Find this compound or compounds like it in BindingDB:
Activity Spreadsheet -- Enzyme Inhibition Constant Data from BindingDB
Found 1 hit for monomerid = 436106
TargetTransient receptor potential cation channel subfamily V member 4(Homo sapiens (Human))
Glaxosmithkline Intellectual Property Development
US Patent
LigandPNGBDBM436106(4-(((3S,4S)-4-(aminomethyl)-1-((5-chloropyridin-2-...)
Affinity DataIC50:  5nM. Assay description: TRPV4 channel activation results in an influx of divalent and monovalent cations including calcium. The resulting changes in intracellular calcium we...
Ligand InfoPC cidPC sid
In DepthDetails US Patent