BDBM437521 2-[4-(1,5-Dimethyl-6-oxo-1,6-dihydro-pyridin-3-yl)- pyrazol-1-yl]-benzoic acid::US10617680, Example 255::US11020380, Example 255
SMILES Cc1cc(cn(C)c1=O)-c1cnn(c1)-c1ccccc1C(O)=O
InChI Key InChIKey=RTKVBLLGRKVENP-UHFFFAOYSA-N
Data  2 IC50
  Tab Delimited (TSV)   2D SDfile   Computed 3D by Vconf -m prep SDfile
Find this compound or compounds like it in BindingDB:
Activity Spreadsheet -- Enzyme Inhibition Constant Data from BindingDB
Found 2 hits for monomerid = 437521
TargetCREB-binding protein(Homo sapiens (Human))
Celgene Quanticel Research
US Patent
LigandPNGBDBM437521(2-[4-(1,5-Dimethyl-6-oxo-1,6-dihydro-pyridin-3-yl)...)
Affinity DataIC50: <500nM. Assay description: The CBP-inhibitory activity of the compounds described herein was determined by calculating the IC50. More specifically, CBP inhibitor activity was a...
Ligand InfoPC cidPC sid
In DepthDetails US Patent
TargetCREB-binding protein(Homo sapiens (Human))
Celgene Quanticel Research
US Patent
LigandPNGBDBM437521(2-[4-(1,5-Dimethyl-6-oxo-1,6-dihydro-pyridin-3-yl)...)
Affinity DataIC50: <500nM. Assay description: The CBP-inhibitory activity of the compounds described herein was determined by calculating the IC50. More specifically, CBP inhibitor activity was a...
Ligand InfoPC cidPC sid
In DepthDetails US Patent