BDBM438846 3-((1R,5S,9r)-3-(bicyclo[3.1.0]hexan-3-yl)-9-methoxy-3-azabicyclo[3.3.1]nonan-9-yl)benzamide hydrochloride::US10604489, Compound 11::US11180455, Compound 199
SMILES COC1(C2CCCC1CN(C2)C1C[C@@H]2C[C@@H]2C1)c1cccc(c1)C(N)=O
InChI Key InChIKey=ACYSJJLGQIICJR-LJEPKCQMSA-N
Data  3 KI
  Tab Delimited (TSV)   2D SDfile   Computed 3D by Vconf -m prep SDfile
Find this compound or compounds like it in BindingDB:
Activity Spreadsheet -- Enzyme Inhibition Constant Data from BindingDB
Found 3 hits for monomerid = 438846
TargetMu-type opioid receptor(Homo sapiens (Human))
Alkermes
US Patent
LigandPNGBDBM438846(3-((1R,5S,9r)-3-(bicyclo[3.1.0]hexan-3-yl)-9-metho...)
Affinity DataKi: <1nM. Assay description: Membrane protein from CHO (Chinese Hamster Ovarian) cells that stably expressed one type of the cloned human opioid receptor were incubated with 12 d...
Ligand InfoPC cidPC sid
In DepthDetails US Patent
TargetMu-type opioid receptor(Homo sapiens (Human))
Alkermes
US Patent
LigandPNGBDBM438846(3-((1R,5S,9r)-3-(bicyclo[3.1.0]hexan-3-yl)-9-metho...)
Affinity DataKi: <1nM. Assay description: The Ki (binding affinity) for μ-receptor was determined with a previously described method using a competitive displacement assay (Neumeyer et a...
Ligand InfoPC cidPC sid
In DepthDetails US Patent
TargetMu-type opioid receptor(Homo sapiens (Human))
Alkermes
US Patent
LigandPNGBDBM438846(3-((1R,5S,9r)-3-(bicyclo[3.1.0]hexan-3-yl)-9-metho...)
Affinity DataKi: <1nM. Assay description: The Ki (binding affinity) for μ-receptor was determined with a previously described method using a competitive displacement assay (Neumeyer et a...
Ligand InfoPC cidPC sid
In DepthDetails US Patent