BDBM438852 US10604489, Compound 16
SMILES COC1(C2CCCC1CN(C2)C1CC2CCC(C1)O2)c1cccc(c1)C(N)=O
InChI Key InChIKey=DCLMQBRZENGABD-UHFFFAOYSA-N
Data  1 KI
  Tab Delimited (TSV)   2D SDfile   Computed 3D by Vconf -m prep SDfile
Find this compound or compounds like it in BindingDB:
Activity Spreadsheet -- Enzyme Inhibition Constant Data from BindingDB
Found 1 hit for monomerid = 438852
TargetMu-type opioid receptor(Homo sapiens (Human))
Alkermes
US Patent
LigandPNGBDBM438852(US10604489, Compound 16)
Affinity DataKi: <1nM. Assay description: Membrane protein from CHO (Chinese Hamster Ovarian) cells that stably expressed one type of the cloned human opioid receptor were incubated with 12 d...
Ligand InfoPC cidPC sid
In DepthDetails US Patent