BDBM438867 3-((1R,5S,9r)-3-butyl-9-methoxy-3-azabicyclo[3.3.1]nonan-9-yl)benzamide hydrochloride::US10604489, Compound 29::US11180455, Compound 29
SMILES CCCCN1CC2CCCC(C1)C2(OC)c1cccc(c1)C(N)=O
InChI Key InChIKey=ZRHIIQAOBONBFV-UHFFFAOYSA-N
Data  2 KI
  Tab Delimited (TSV)   2D SDfile   Computed 3D by Vconf -m prep SDfile
Find this compound or compounds like it in BindingDB:
Activity Spreadsheet -- Enzyme Inhibition Constant Data from BindingDB
Found 2 hits for monomerid = 438867
TargetMu-type opioid receptor(Homo sapiens (Human))
TBA
US Patent
LigandPNGBDBM438867(3-((1R,5S,9r)-3-butyl-9-methoxy-3-azabicyclo[3.3.1...)
Affinity DataKi: <1nM. Assay description: The Ki (binding affinity) for μ-receptor was determined with a previously described method using a competitive displacement assay (Neumeyer et a...
Ligand InfoPC cidPC sid
In DepthDetails US Patent
TargetMu-type opioid receptor(Homo sapiens (Human))
TBA
US Patent
LigandPNGBDBM438867(3-((1R,5S,9r)-3-butyl-9-methoxy-3-azabicyclo[3.3.1...)
Affinity DataKi: <1nM. Assay description: Membrane protein from CHO (Chinese Hamster Ovarian) cells that stably expressed one type of the cloned human opioid receptor were incubated with 12 d...
Ligand InfoPC cidPC sid
In DepthDetails US Patent