BDBM441855 US10647686, Example (3)
SMILES CC(C)c1ccc(Nc2ncc(Cl)c(NCCCN)n2)cc1
InChI Key InChIKey=SOJKVKSSTDCNFB-UHFFFAOYSA-N
Data  2 IC50
  Tab Delimited (TSV)   2D SDfile   Computed 3D by Vconf -m prep SDfile
Find this compound or compounds like it in BindingDB:
Activity Spreadsheet -- Enzyme Inhibition Constant Data from BindingDB
Found 2 hits for monomerid = 441855
TargetSerine/threonine-protein kinase 17A(Homo sapiens (Human))
Korea Research Institute of Chemical Technology
US Patent
LigandPNGBDBM441855(US10647686, Example (3))
Affinity DataIC50:  11nM. Assay description: To measure the DRAK1 and DRAK2 activity, the substrate MRCL3 peptide and ATP were mixed with the enzymes. After an appropriate period of time, the re...
Ligand InfoPC cidPC sid
In DepthDetails US Patent
TargetSerine/threonine-protein kinase 17B(Homo sapiens (Human))
Korea Research Institute of Chemical Technology
US Patent
LigandPNGBDBM441855(US10647686, Example (3))
Affinity DataIC50:  240nM. Assay description: To measure the DRAK1 and DRAK2 activity, the substrate MRCL3 peptide and ATP were mixed with the enzymes. After an appropriate period of time, the re...
Ligand InfoPC cidPC sid
In DepthDetails US Patent