BDBM441870 US10647686, Example (17)
SMILES NCCCNc1nc(Nc2ccc(Br)cc2)ncc1Cl
InChI Key InChIKey=CUGHJABOPLILMY-UHFFFAOYSA-N
Data  2 IC50
  Tab Delimited (TSV)   2D SDfile   Computed 3D by Vconf -m prep SDfile
Find this compound or compounds like it in BindingDB:
Activity Spreadsheet -- Enzyme Inhibition Constant Data from BindingDB
Found 2 hits for monomerid = 441870
TargetSerine/threonine-protein kinase 17A(Homo sapiens (Human))
Korea Research Institute of Chemical Technology
US Patent
LigandPNGBDBM441870(US10647686, Example (17))
Affinity DataIC50:  23nM. Assay description: To measure the DRAK1 and DRAK2 activity, the substrate MRCL3 peptide and ATP were mixed with the enzymes. After an appropriate period of time, the re...
Ligand InfoPC cidPC sid
In DepthDetails US Patent
TargetSerine/threonine-protein kinase 17B(Homo sapiens (Human))
Korea Research Institute of Chemical Technology
US Patent
LigandPNGBDBM441870(US10647686, Example (17))
Affinity DataIC50:  390nM. Assay description: To measure the DRAK1 and DRAK2 activity, the substrate MRCL3 peptide and ATP were mixed with the enzymes. After an appropriate period of time, the re...
Ligand InfoPC cidPC sid
In DepthDetails US Patent