BDBM445663 Ex. 1/KM-06-30/(I-1)::US10683309, Example 1::US11028104, Example 1
SMILES CCn1c2nc(Cc3cn4ccccc4n3)n(Cc3ccccc3)c2c(=O)[nH]c1=O
InChI Key InChIKey=KTMJKDQZZJLZQQ-UHFFFAOYSA-N
Data  4 IC50
  Tab Delimited (TSV)   2D SDfile   Computed 3D by Vconf -m prep SDfile
Find this compound or compounds like it in BindingDB:
Activity Spreadsheet -- Enzyme Inhibition Constant Data from BindingDB
Found 4 hits for monomerid = 445663
TargetTryptophan 5-hydroxylase 1(Homo sapiens (Human))
Max-DelbrÜCk-Centrum FÜR Molekulare Medizin
US Patent
LigandPNGBDBM445663(Ex. 1/KM-06-30/(I-1) | US10683309, Example 1 | US1...)
Affinity DataIC50:  770nM. Assay description: The full-length coding sequences of human TPH1 and TPH2 were PCR amplified, ligated into a MBP fusion vector (pMalc2x, New England Biolabs, MA, USA) ...
Ligand InfoPC cidPC sid
In DepthDetails US Patent
TargetTryptophan 5-hydroxylase 2(Homo sapiens (Human))
Max-DelbrÜCk-Centrum FÜR Molekulare Medizin
US Patent
LigandPNGBDBM445663(Ex. 1/KM-06-30/(I-1) | US10683309, Example 1 | US1...)
Affinity DataIC50:  43nM. Assay description: The full-length coding sequences of human TPH1 and TPH2 were PCR amplified, ligated into a MBP fusion vector (pMalc2x, New England Biolabs, MA, USA) ...
Ligand InfoPC cidPC sid
In DepthDetails US Patent
TargetTryptophan 5-hydroxylase 1(Homo sapiens (Human))
Max-DelbrÜCk-Centrum FÜR Molekulare Medizin
US Patent
LigandPNGBDBM445663(Ex. 1/KM-06-30/(I-1) | US10683309, Example 1 | US1...)
Affinity DataIC50:  770nM. Assay description: The full-length coding sequences of human TPH1 and TPH2 were PCR amplified, ligated into a MBP fusion vector (pMalc2x, New England Biolabs, MA, USA) ...
Ligand InfoPC cidPC sid
In DepthDetails US Patent
TargetTryptophan 5-hydroxylase 2(Homo sapiens (Human))
Max-DelbrÜCk-Centrum FÜR Molekulare Medizin
US Patent
LigandPNGBDBM445663(Ex. 1/KM-06-30/(I-1) | US10683309, Example 1 | US1...)
Affinity DataIC50:  43nM. Assay description: The full-length coding sequences of human TPH1 and TPH2 were PCR amplified, ligated into a MBP fusion vector (pMalc2x, New England Biolabs, MA, USA) ...
Ligand InfoPC cidPC sid
In DepthDetails US Patent