BDBM44587 2-(2,4-diketo-3-phenyl-thiazolidin-5-yl)-N-phenyl-acetamide::2-(2,4-dioxo-3-phenyl-1,3-thiazolidin-5-yl)-N-phenylacetamide::2-(2,4-dioxo-3-phenyl-5-thiazolidinyl)-N-phenylacetamide::2-[2,4-bis(oxidanylidene)-3-phenyl-1,3-thiazolidin-5-yl]-N-phenyl-ethanamide::MLS000078498::SMR000036257::cid_660584
SMILES Oc1c(CC(=O)Nc2ccccc2)sc(=O)n1-c1ccccc1
InChI Key InChIKey=UDCUEJBCFVMLPG-UHFFFAOYSA-N
Data  4 IC50  1 EC50
  Tab Delimited (TSV)   2D SDfile   Computed 3D by Vconf -m prep SDfile
Find this compound or compounds like it in BindingDB:
Activity Spreadsheet -- Enzyme Inhibition Constant Data from BindingDB
Found 5 hits for monomerid = 44587
TargetMultidrug resistance-associated protein 1(Homo sapiens (Human))
Srmlsc
Curated by PubChem BioAssay
LigandPNGBDBM44587(2-(2,4-diketo-3-phenyl-thiazolidin-5-yl)-N-phenyl-...)
Affinity DataEC50:  6.42E+3nM. Assay description: Southern Research Molecular Libraries Screening Center (SRMLSC) Southern Research Institute (Birmingham, Alabama) NIH Molecular Libraries Screening C...
In DepthDetails PCBioAssay
TargetPolyadenylate-binding protein 1(Homo sapiens (Human))
Burnham Center For Chemical Genomics
Curated by PubChem BioAssay
LigandPNGBDBM44587(2-(2,4-diketo-3-phenyl-thiazolidin-5-yl)-N-phenyl-...)
Affinity DataIC50: >6.60E+4nM. Assay description: Data Source: Sanford-Burnham Center for Chemical Genomics (SBCCG) Source Affiliation: Sanford-Burnham Medical Research Institute (SBMRI, San Diego, C...
In DepthDetails PCBioAssay
TargetDisintegrin and metalloproteinase domain-containing protein 17(Homo sapiens (Human))
The Scripps Research Institute Molecular Screening Center
Curated by PubChem BioAssay
LigandPNGBDBM44587(2-(2,4-diketo-3-phenyl-thiazolidin-5-yl)-N-phenyl-...)
Affinity DataIC50:  4.67E+4nM. Assay description: Source (MLPCN Center Name): The Scripps Research Institute Molecular Screening Center (SRIMSC) Center Affiliation: Torrey Pines Institute for Molecul...
In DepthDetails PCBioAssay
TargetDisintegrin and metalloproteinase domain-containing protein 10(Homo sapiens (Human))
The Scripps Research Institute Molecular Screening Center
Curated by PubChem BioAssay
LigandPNGBDBM44587(2-(2,4-diketo-3-phenyl-thiazolidin-5-yl)-N-phenyl-...)
Affinity DataIC50:  4.78E+4nM. Assay description: Source (MLPCN Center Name): The Scripps Research Institute Molecular Screening Center (SRIMSC) Center Affiliation: Torrey Pines Institute for Molecul...
In DepthDetails PCBioAssay
TargetPolyadenylate-binding protein 1(Homo sapiens (Human))
Burnham Center For Chemical Genomics
Curated by PubChem BioAssay
LigandPNGBDBM44587(2-(2,4-diketo-3-phenyl-thiazolidin-5-yl)-N-phenyl-...)
Affinity DataIC50: >6.60E+4nM. Assay description: Data Source: Sanford-Burnham Center for Chemical Genomics (SBCCG) Source Affiliation: Sanford-Burnham Medical Research Institute (SBMRI, San Diego, C...
In DepthDetails PCBioAssay