BDBM44683 2-[[1-oxo-2-(1H-1,2,4-triazol-5-ylthio)ethyl]amino]-4-thiophen-2-yl-3-thiophenecarboxylic acid ethyl ester::4-(2-thienyl)-2-[[2-(1H-1,2,4-triazol-5-ylthio)acetyl]amino]thiophene-3-carboxylic acid ethyl ester::MLS000050319::SMR000077549::cid_2214399::ethyl 4-thiophen-2-yl-2-[2-(1H-1,2,4-triazol-5-ylsulfanyl)ethanoylamino]thiophene-3-carboxylate::ethyl 4-thiophen-2-yl-2-[[2-(1H-1,2,4-triazol-5-ylsulfanyl)acetyl]amino]thiophene-3-carboxylate::ethyl 5'-{[(1H-1,2,4-triazol-3-ylthio)acetyl]amino}-2,3'-bithiophene-4'-carboxylate
SMILES CCOC(=O)c1c(NC(=O)CSc2nnc[nH]2)scc1-c1cccs1
InChI Key InChIKey=JRKDQGNFXYQKBA-UHFFFAOYSA-N
Data  1 EC50
  Tab Delimited (TSV)   2D SDfile   Computed 3D by Vconf -m prep SDfile
Find this compound or compounds like it in BindingDB:
Activity Spreadsheet -- Enzyme Inhibition Constant Data from BindingDB
Found 1 hit for monomerid = 44683
TargetMultidrug resistance-associated protein 1(Homo sapiens (Human))
Srmlsc
Curated by PubChem BioAssay
LigandPNGBDBM44683(2-[[1-oxo-2-(1H-1,2,4-triazol-5-ylthio)ethyl]amino...)
Affinity DataEC50:  1.09E+3nM. Assay description: Southern Research Molecular Libraries Screening Center (SRMLSC) Southern Research Institute (Birmingham, Alabama) NIH Molecular Libraries Screening C...
In DepthDetails PCBioAssay