BDBM447523 (R)—N-(1-cyanopyrrolidin-3-yl)-3-(N-methylisobutyramido)benzamide::US10689345, Example 62::US11053198, Example 62::US11390584, Example 62
SMILES CC(C)C(=O)N(C)c1cccc(c1)C(=O)N[C@@H]1CCN(C1)C(=O)OC(C)(C)C
InChI Key InChIKey=CDNLXHOCNAUWNG-MRXNPFEDSA-N
Data  3 IC50
  Tab Delimited (TSV)   2D SDfile   Computed 3D by Vconf -m prep SDfile
Find this compound or compounds like it in BindingDB:
Activity Spreadsheet -- Enzyme Inhibition Constant Data from BindingDB
Found 3 hits for monomerid = 447523
TargetUbiquitin carboxyl-terminal hydrolase 30(Homo sapiens (Human))
Mission Therapeutics
US Patent
LigandPNGBDBM447523((R)—N-(1-cyanopyrrolidin-3-yl)-3-(N-methyliso...)
Affinity DataIC50:  550nM. Assay description: USP30 Biochemical Fluorescence Intensity Kinetic Assay.Reactions were performed in duplicate in black 384 well plates (small volume, Greiner 784076) ...
Ligand InfoPC cidPC sid
In DepthDetails US Patent
TargetUbiquitin carboxyl-terminal hydrolase 30(Homo sapiens (Human))
Mission Therapeutics
US Patent
LigandPNGBDBM447523((R)—N-(1-cyanopyrrolidin-3-yl)-3-(N-methyliso...)
Affinity DataIC50:  550nM. Assay description: Dilution plates were prepared at 21 times the final concentration (2100 μM for a final concentration of 100 μM) in 50% DMSO in a 96-well po...
Ligand InfoPC cidPC sid
In DepthDetails US Patent
TargetUbiquitin carboxyl-terminal hydrolase 30(Homo sapiens (Human))
Mission Therapeutics
US Patent
LigandPNGBDBM447523((R)—N-(1-cyanopyrrolidin-3-yl)-3-(N-methyliso...)
Affinity DataIC50:  550nM. Assay description: Dilution plates were prepared at 21 times the final concentration (2100 μM for a final concentration of 100 μM) in 50% DMSO in a 96-well po...
Ligand InfoPC cidPC sid
In DepthDetails US Patent