BDBM447524 (R)—N-(1-cyanopyrrolidin-3-yl)-5-phenylpyrimidine-2-carboxamide::US10689345, Example 63::US11053198, Example 63::US11390584, Example 63
SMILES CC(C)(C)OC(=O)N1CC[C@H](C1)NC(=O)c1ncc(cn1)-c1ccccc1
InChI Key InChIKey=WONPJUMUKLKCRR-MRXNPFEDSA-N
Data  3 IC50
  Tab Delimited (TSV)   2D SDfile   Computed 3D by Vconf -m prep SDfile
Find this compound or compounds like it in BindingDB:
Activity Spreadsheet -- Enzyme Inhibition Constant Data from BindingDB
Found 3 hits for monomerid = 447524
TargetUbiquitin carboxyl-terminal hydrolase 30(Homo sapiens (Human))
Mission Therapeutics
US Patent
LigandPNGBDBM447524((R)—N-(1-cyanopyrrolidin-3-yl)-5-phenylpyrimi...)
Affinity DataIC50:  550nM. Assay description: USP30 Biochemical Fluorescence Intensity Kinetic Assay.Reactions were performed in duplicate in black 384 well plates (small volume, Greiner 784076) ...
Ligand InfoPC cidPC sid
In DepthDetails US Patent
TargetUbiquitin carboxyl-terminal hydrolase 30(Homo sapiens (Human))
Mission Therapeutics
US Patent
LigandPNGBDBM447524((R)—N-(1-cyanopyrrolidin-3-yl)-5-phenylpyrimi...)
Affinity DataIC50:  550nM. Assay description: Dilution plates were prepared at 21 times the final concentration (2100 μM for a final concentration of 100 μM) in 50% DMSO in a 96-well po...
Ligand InfoPC cidPC sid
In DepthDetails US Patent
TargetUbiquitin carboxyl-terminal hydrolase 30(Homo sapiens (Human))
Mission Therapeutics
US Patent
LigandPNGBDBM447524((R)—N-(1-cyanopyrrolidin-3-yl)-5-phenylpyrimi...)
Affinity DataIC50:  550nM. Assay description: Dilution plates were prepared at 21 times the final concentration (2100 μM for a final concentration of 100 μM) in 50% DMSO in a 96-well po...
Ligand InfoPC cidPC sid
In DepthDetails US Patent