BDBM449519 US10703733, Example 132::US10988451, Example 132::US11643400, Example 132
SMILES COCCNC(=O)N[S@@]1(=O)=NC(=O)c2ccc3OC[C@]4(CCCc5cc(Cl)ccc45)CN(C[C@@H]4CC[C@H]4[C@@H](OC)\C=C\C[C@H](C)C1)c3c2
InChI Key InChIKey=LDDHSAJSEWBTKH-QHUPJBNYSA-N
Data  3 IC50
  Tab Delimited (TSV)   2D SDfile   Computed 3D by Vconf -m prep SDfile
Find this compound or compounds like it in BindingDB:
Activity Spreadsheet -- Enzyme Inhibition Constant Data from BindingDB
Found 3 hits for monomerid = 449519
LigandPNGBDBM449519(US10703733, Example 132 | US10988451, Example 132 ...)
Affinity DataIC50:  0.0380nM. Assay description: The AlphaLISA assay was performed in a 384-well Proxiplate in a total volume of 40 μL. The reaction mixture contained 0.0625 nM 6×His-Mcl-1 (171...
Ligand InfoPC cidPC sid
In DepthDetails US Patent
LigandPNGBDBM449519(US10703733, Example 132 | US10988451, Example 132 ...)
Affinity DataIC50:  0.0380nM. Assay description: The AlphaLISA assay was performed in a 384-well Proxiplate in a total volume of 40 μL. The reaction mixture contained 0.0625 nM 6×His-Mcl-1 (171...
Ligand InfoPC cidPC sid
In DepthDetails US Patent
TargetInduced myeloid leukemia cell differentiation protein Mcl-1 [171-327](Homo sapiens (Human))
Gilead Sciences
US Patent
LigandPNGBDBM449519(US10703733, Example 132 | US10988451, Example 132 ...)
Affinity DataIC50:  0.0380nM. Assay description: The AlphaLISA assay was performed in a 384-well Proxiplate in a total volume of 40 μL. The reaction mixture contained 0.0625 nM 6× His-Mcl-1 (17...
Ligand InfoPC cidPC sid
In DepthDetails US Patent