BDBM449708 US10703733, Example 321::US10988451, Example 321::US11643400, Example 321
SMILES C[C@H]1C\C=C\[C@H](O)[C@@H]2CC[C@H]2CN2C[C@@]3(CCCc4cc(Cl)ccc34)COc3ccc(cc23)C(=O)N=[S@@](=O)(C1)NC(=O)N[C@H]1C[C@@H]1C(F)F
InChI Key InChIKey=PTHSQDFMFIQJRX-VOOSZGBBSA-N
Data  3 IC50
  Tab Delimited (TSV)   2D SDfile   Computed 3D by Vconf -m prep SDfile
Find this compound or compounds like it in BindingDB:
Activity Spreadsheet -- Enzyme Inhibition Constant Data from BindingDB
Found 3 hits for monomerid = 449708
LigandPNGBDBM449708(US10703733, Example 321 | US10988451, Example 321 ...)
Affinity DataIC50:  0.0370nM. Assay description: The AlphaLISA assay was performed in a 384-well Proxiplate in a total volume of 40 μL. The reaction mixture contained 0.0625 nM 6×His-Mcl-1 (171...
Ligand InfoPC cidPC sid
In DepthDetails US Patent
LigandPNGBDBM449708(US10703733, Example 321 | US10988451, Example 321 ...)
Affinity DataIC50:  0.0370nM. Assay description: The AlphaLISA assay was performed in a 384-well Proxiplate in a total volume of 40 μL. The reaction mixture contained 0.0625 nM 6×His-Mcl-1 (171...
Ligand InfoPC cidPC sid
In DepthDetails US Patent
TargetInduced myeloid leukemia cell differentiation protein Mcl-1 [171-327](Homo sapiens (Human))
Gilead Sciences
US Patent
LigandPNGBDBM449708(US10703733, Example 321 | US10988451, Example 321 ...)
Affinity DataIC50:  0.0370nM. Assay description: The AlphaLISA assay was performed in a 384-well Proxiplate in a total volume of 40 μL. The reaction mixture contained 0.0625 nM 6× His-Mcl-1 (17...
Ligand InfoPC cidPC sid
In DepthDetails US Patent