BDBM450837 US10676469, Compound 95::US11124504, Cpd. No. 95
SMILES Cc1noc(n1)-c1c(C)c2cc(cc(F)c2nc1N1CCC(CC1)N[C@@H]1CCCOC1)C(C)(F)F
InChI Key InChIKey=WDAILMSABSMAKY-GOSISDBHSA-N
Data  2 IC50
  Tab Delimited (TSV)   2D SDfile   Computed 3D by Vconf -m prep SDfile
Find this compound or compounds like it in BindingDB:
Activity Spreadsheet -- Enzyme Inhibition Constant Data from BindingDB
Found 2 hits for monomerid = 450837
TargetMu-type opioid receptor(Homo sapiens (Human))
Blackthorn Therapeutics
US Patent
LigandPNGBDBM450837(US10676469, Compound 95 | US11124504, Cpd. No. 95)
Affinity DataIC50: >1.00E+3nM. Assay description: The purpose of this assay is to confirm the potency and selectivity of compounds synthesized to be OPRK1 Antagonists. This assay monitors the OPRMu1 ...
Ligand InfoPC cidPC sid
In DepthDetails US Patent
TargetKappa-type opioid receptor(Homo sapiens (Human))
Blackthorn Therapeutics
US Patent
LigandPNGBDBM450837(US10676469, Compound 95 | US11124504, Cpd. No. 95)
Affinity DataIC50:  55nM. Assay description: The cell line for the OPRK1 antagonist assay stably expresses the following elements: The carboxy terminus of the OPRK1 receptor has a 7-amino acid l...
Ligand InfoPC cidPC sid
In DepthDetails US Patent